{"text_format":"1","workbook":"xlsx","n_sheets":4,"sheets":["BGS Cost & Bid Factors","Weighted Avg Price Calc","Rate Calculations","Backup Calcs"],"not_rendered":{"charts":0,"images":0,"macros":0,"external_links":12,"defined_names":407,"comments":0,"pivot_tables":0},"unopened":[],"bounds":{"document_bytes":16777216,"sheet_cells":100000,"rows_first":2000,"rows_last":500,"rows_between":2000,"halvings":0,"cell_chars":16384,"cell_head_chars":4096},"cells_cut":0,"cells_raw":0,"read":"whole","date_system":"1900"}

{"sheet":"BGS Cost & Bid Factors","index":0,"n_rows":610,"n_cols":27,"rows_kept":610,"cut":false,"hidden":false,"merged":[[209,19,209,20],[375,8,375,9],[397,8,397,9]]}
[null,{"$f":"\"Development of BGS Cost and Bid Factors for Rates Effective June 1, \" &M1","v":"Development of BGS Cost and Bid Factors for Rates Effective June 1, 2022"},null,null,null,null,null,null,null,null,null,null,2022,"<<< Year of the auction"]
[]
[null,null,null,{"$f":"\"Based on \" &M1-1  &\" Load Profile Information\"","v":"Based on 2021 Load Profile Information"}]
["Table #1","% Usage During PJM On-Peak Period",null,"On-Peak periods defined as the 16 hr PJM Trading period, adj for NERC holidays",null,null,null,null,null,null,null,{"$f":"\"'% usage during Off-Peak period (from \"&M1-1&\" profiles)\"","v":"'% usage during Off-Peak period (from 2021 profiles)"}]
[null,null,"Profile Meter Data","Profile Meter Data","Profile Meter Data","   --- Other Analysis ---",null,"Profile Meter Data",null,null,null,"Profile Meter Data","Profile Meter Data","Profile Meter Data"," -- Other Analysis --",null,"Profile Meter Data"]
[null,null,"SC1","SC3","SC2 ND","SC4","SC6","SC2 Dem",null,null,null,{"$f":"+C6","v":"SC1"},"SC3","SC2 ND","SC4","SC6","SC2 Dem"]
[]
[null,"January",0.41586027693136868,0.45255312285509552,0.32844313711550627,0.49396201750906749,{"$f":"F8","v":0.49396201750906749},0.48293282703884877,null,null,null,{"$f":"1-C8","v":0.58413972306863138},0.54744687714490448,0.67155686288449368,0.50603798249093246,0.50603798249093246,0.51706717296115123]
[null,"February",0.45459235640647283,0.49347954380352294,0.36180062668171481,0.53024884905253877,{"$f":"F9","v":0.53024884905253877},0.52032532567065604,null,null,null,0.54540764359352711,0.50652045619647712,0.63819937331828513,0.46975115094746123,0.46975115094746123,0.47967467432934396]
[null,"March",0.47877247998186895,0.51275904068566602,0.36797325071491799,0.55177175734087569,0.55177175734087569,0.54314951879908469,null,null,null,0.52122752001813111,0.48724095931433398,0.63202674928508196,0.44822824265912431,0.44822824265912431,0.45685048120091531]
[null,"April",0.47580705729475697,0.50327178938632566,0.36808585216138973,0.54471324265278132,0.54471324265278132,0.54263803531648758,null,null,null,0.52419294270524297,0.49672821061367434,0.63191414783861033,0.45528675734721868,0.45528675734721868,0.45736196468351242]
[null,"May",0.42043993607420027,0.45497046169459338,0.29260536927944036,0.48961046885554355,0.48961046885554355,0.49182264593008596,null,null,null,0.57956006392579973,0.54502953830540668,0.70739463072055964,0.5103895311444564,0.5103895311444564,0.50817735406991404]
[null,"June",0.4891456463655543,0.51240953300497505,0.31775433775788992,0.54789499178832779,0.54789499178832779,0.55335852670449281,null,null,null,0.51085435363444565,0.48759046699502495,0.68224566224211003,0.45210500821167221,0.45210500821167221,0.44664147329550719]
[null,"July",0.44959476101459167,0.48542440996834119,0.28622969565576639,0.50793861238183169,0.50793861238183169,0.50832240698422715,null,null,null,0.55040523898540838,0.51457559003165887,0.71377030434423361,0.49206138761816831,0.49206138761816831,0.49167759301577285]
[null,"August",0.49313895202143876,0.50686769872888759,0.30971114345556544,0.53512463229496876,0.53512463229496876,0.54003256626590279,null,null,null,0.50686104797856124,0.49313230127111241,0.6902888565444345,0.46487536770503124,0.46487536770503124,0.45996743373409721]
[null,"September",0.47185772383886793,0.49575907479915676,0.35045972103001771,0.53174882883232566,0.53174882883232566,0.53261717795942898,null,null,null,0.52814227616113207,0.50424092520084329,0.64954027896998223,0.46825117116767434,0.46825117116767434,0.46738282204057102]
[null,"October",0.44952102971235808,0.49290100839877493,0.34039300254943405,0.51559042677182765,0.51559042677182765,0.51145727357183601,null,null,null,0.55047897028764192,0.50709899160122507,0.65960699745056595,0.48440957322817235,0.48440957322817235,0.48854272642816399]
[null,"November",0.44991463138933457,0.50550233602208716,0.3579207104557397,0.52708542362051503,0.52708542362051503,0.51592112096634724,null,null,null,0.55008536861066548,0.49449766397791284,0.6420792895442603,0.47291457637948497,0.47291457637948497,0.48407887903365276]
[null,"December",0.47748656530301725,0.52819650578125388,0.3784929227442777,0.54169246783101832,0.54169246783101832,0.53606089069154805,null,null,null,0.52251343469698275,0.47180349421874612,0.6215070772557223,0.45830753216898168,0.45830753216898168,0.46393910930845195]
[]
[]
["Table #2","% Usage During RECO On-Peak Billing Period",null,null,"On-Peak periods as defined in specified rate schedule"]
[null,null,"N/A",null,"N/A","N/A","N/A","N/A",null,null,null,"N/A",{"$f":"M1-2&\" Forecasted Billed Sales\"","v":"2020 Forecasted Billed Sales"},"N/A","N/A","N/A","N/A"]
[null,"(data rounded to nearest %)",{"$f":"+C6","v":"SC1"},{"$f":"+D6","v":"SC3"},"SC2 ND","SC4","SC6","SC2 Dem",null,null,null,{"$f":"+C6","v":"SC1"},"SC3","SC2 ND","SC4","SC6","SC2 Dem"]
[]
[null,"January","----",0.32595656670113754,"----","----","----","----",null,null,null,null,{"$f":"1-D26","v":0.67404343329886252}]
[null,"February","----",0.35905680600214362,"----","----","----","----",null,null,null,null,0.64094319399785638]
[null,"March","----",0.33603912305798594,"----","----","----","----",null,null,null,null,0.663960876942014]
[null,"April","----",0.34774089442139233,"----","----","----","----",null,null,null,null,0.65225910557860767]
[null,"May","----",0.35975147030923921,"----","----","----","----",null,null,null,null,0.64024852969076074]
[null,"June","----",0.39489624951669028,"----","----","----","----",null,null,null,null,0.60510375048330967]
[null,"July","----",0.4169343227378447,"----","----","----","----",null,null,null,null,0.5830656772621553]
[null,"August","----",0.42892105024624588,"----","----","----","----",null,null,null,null,0.57107894975375406]
[null,"September","----",0.41815557337610265,"----","----","----","----",null,null,null,null,0.58184442662389735]
[null,"October","----",0.39968445963712856,"----","----","----","----",null,null,null,null,0.60031554036287149]
[null,"November","----",0.37566715186802524,"----","----","----","----",null,null,null,null,0.62433284813197476]
[null,"December","----",0.35755115297174406,"----","----","----","----",null,null,null,null,0.64244884702825589]
[]
[]
["Table #3","Class Usage @ customer",null,null,null,null,null,null,null,null,null,"Usage by season"]
{"$rows_left_out":571}
{"sheet":"Weighted Avg Price Calc","index":1,"n_rows":51,"n_cols":11,"rows_kept":51,"cut":false,"hidden":false,"merged":[]}
["ROCKLAND ELECTRIC COMPANY"]
[{"$f":"'BGS Cost & Bid Factors'!M1&\" BGS Auction\"","v":"2022 BGS Auction"}]
[]
["Table A","Weighted Average Price Calculation"]
[]
[null,null,null,{"$f":"F6-2","v":2020},{"$f":"F6-1","v":2021},2022]
[null,null,null,"Auction","Auction","Auction"]
[null,"Line #","Specific BGS-FP Auction >>","36 Month","36 Month","36 Month","Total",null,"Notes:"]
[null,1,"Tranches",2,1,1,{"$f":"SUM(D9:F9)","v":4},null,"From then-current auction"]
[null,"2(a)","Winning Bid Price (¢/kWh)*",8.2420000000000009,6.6920000000000002,6.6920000000000002,null,null,{"$f":"\"(Note: \"&F6&\" Auction Price Shown for Illustrative Purposes Only)\"","v":"(Note: 2022 Auction Price Shown for Illustrative Purposes Only)"}]
[null,"2(b)","Capacity Proxy Price True-up - in (¢/kWh)*",-0.73399999999999999,-0.73399999999999999,0,null,null,"Entered After 2022 BGS Auction"]
[null,"2(C)","Winning Bid Price (¢/kWh)*",{"$f":"D11+D10","v":7.5080000000000009},{"$f":"E11+E10","v":5.9580000000000002},6.6920000000000002,null,null," = 2(a) + 2(b)"]
[null,3,"Transmission (¢/kWh)",1.327,0,0,null,null,"Average transmission cost included in bid for existing tranches only"]
[null,4,"BGS (¢/kWh)",{"$f":"D12-D13","v":6.1810000000000009},{"$f":"E12-E13","v":5.9580000000000002},6.6920000000000002,null,null,"=(2) - (3)"]
[null,5,"Weighted Avg BGS",{"$f":"D9/$G$9*D14","v":3.0905000000000005},{"$f":"E9/$G$9*E14","v":1.4895},{"$f":"F9/$G$9*F14","v":1.673},{"$f":"SUM(D15:F15)","v":6.2530000000000001},null,"= (1) / Total Tranches * (4)"]
[null,6,"Weighted Avg Trans",{"$f":"D9/$G$9*D13","v":0.66349999999999998},{"$f":"E9/$G$9*E13","v":0},{"$f":"F9/$G$9*F13","v":0},{"$f":"SUM(D16:F16)","v":0.66349999999999998},null,"= (1) / Total Tranches * (3)"]
[null,7,"Weighted Avg Total Price (¢/kWh)",null,null,null,{"$f":"G15+G16","v":6.9165000000000001}]
[]
[null,null,"Seasonal Payment Factors"]
[null,8,"                           Summer",1,1,{"$f":"IF('BGS Cost & Bid Factors'!J377<1,1,'BGS Cost & Bid Factors'!J377)","v":1},"**",null,"From then-current Bid Factor Spreadsheet"]
[null,9,"                           Winter",1,1,{"$f":"IF('BGS Cost & Bid Factors'!J378>1,1,'BGS Cost & Bid Factors'!J378)","v":1},"**",null,"From then-current Bid Factor Spreadsheet"]
[]
[null,null,"Applicable Customer Usage @ transmission nodes",null,null,"(Eastern Division)"]
[null,10,"                           Summer MWh",{"$f":"'Rate Calculations'!$D$251","v":386727.44055912853},null,null,null,null,"From then-current Bid Factor Spreadsheet"]
[null,11,"                           Winter MWh",{"$f":"'Rate Calculations'!$D$252","v":561490.00230262347},null,null,null,null,"From then-current Bid Factor Spreadsheet"]
[null,12,null,{"$f":"SUM(D24:D25)","v":948217.442861752}]
[]
[null,null,"Total Cost"]
[null,13,"Summer",{"$f":"ROUND(D$9/$G$9*(D$12-D$13)/100*D$20*$D$24*1000,0)","v":11951812},{"$f":"ROUND(E$9/$G$9*(E$12-E$13)/100*E$20*$D$24*1000,0)","v":5760305},{"$f":"ROUND(F$9/$G$9*(F$12-F$13)/100*F$20*$D$24*1000,0)","v":6469950},{"$f":"SUM(D29:F29)","v":24182067},null,"= (1) / Total Tranches * (2C - 3) / 100 * (8) * (10) * 1,000"]
[null,14,"Winter",{"$f":"ROUND(D$9/$G$9*(D$12-D$13)/100*D$21*$D$25*1000,0)","v":17352849},{"$f":"ROUND(E$9/$G$9*(E$12-E$13)/100*E$21*$D$25*1000,0)","v":8363394},{"$f":"ROUND(F$9/$G$9*(F$12-F$13)/100*F$21*$D$25*1000,0)","v":9393728},{"$f":"SUM(D30:F30)","v":35109971},null,"= (1) / Total Tranches * (2C - 3) / 100 * (9) * (11) * 1,000"]
[null,15,"Total",{"$f":"SUM(D29:D30)","v":29304661},{"$f":"SUM(E29:E30)","v":14123699},{"$f":"SUM(F29:F30)","v":15863678},{"$f":"SUM(G29:G30)","v":59292038},null,"= (13) + (14)"]
[]
[null,null,"Average Cost (NJ Statewide Auction)"]
[null,16,"Summer",{"$f":"ROUND(G29/D24/1000*100,3)","v":6.2530000000000001},"¢/kWh",null,null,null,"= sum(line 13) / (10) / 1000 * 100  rounded to 3 decimal places"]
[null,17,"Winter",{"$f":"ROUND(G30/D25/1000*100,3)","v":6.2530000000000001},"¢/kWh",null,null,null,"= sum(line 14) / (11) / 1000 * 100  rounded to 3 decimal places"]
[null,18,"Total",{"$f":"ROUND(G31/D26/1000*100,3)","v":6.2530000000000001},"¢/kWh",null,null,null,"= sum(line 15) / (12) / 1000 * 100  rounded to 3 decimal places"]
[]
[null,null,"Average Cost (Including RECO RFP)"]
[null,null,null,"BGS","RECO"]
[null,null,null,"Auction","RFP",null,"Total"]
{"$rows_left_out":12}
{"sheet":"Rate Calculations","index":2,"n_rows":286,"n_cols":34,"rows_kept":286,"cut":false,"hidden":false,"merged":[[256,18,256,20],[256,4,256,6],[256,7,256,9],[256,10,256,12],[256,13,256,14],[256,15,256,17]]}
["ROCKLAND ELECTRIC COMPANY"]
[{"$f":"'BGS Cost & Bid Factors'!M1 &\" BGS Auction\"","v":"2022 BGS Auction"}]
[]
[]
[]
["Table B","Ratio of BGS Unit Costs Less Transmission @ customer to All-In Average Cost @ transmission nodes"]
[null,"(from Table 15 of Bid Factor Spreadsheet)"]
[]
[null,"NON-DEMAND RATES"]
[null,"includes energy, G&T obligations, and Ancillary Services - adjusted to billing time periods"]
[]
[null,null,{"$f":"'BGS Cost & Bid Factors'!C$6","v":"SC1"},{"$f":"'BGS Cost & Bid Factors'!D$6","v":"SC3"},{"$f":"'BGS Cost & Bid Factors'!E$6","v":"SC2 ND"},{"$f":"'BGS Cost & Bid Factors'!F$6","v":"SC4"},{"$f":"'BGS Cost & Bid Factors'!G$6","v":"SC6"}]
[]
[null,"Summer - all hrs",{"$f":"'BGS Cost & Bid Factors'!C327","v":1.004},null,{"$f":"'BGS Cost & Bid Factors'!E327","v":0.89500000000000002},{"$f":"'BGS Cost & Bid Factors'!F327","v":0.81699999999999995},{"$f":"'BGS Cost & Bid Factors'!G327","v":0.81599999999999995}]
[null,"RECO On pk",null,{"$f":"'BGS Cost & Bid Factors'!D328","v":1.377}]
[null,"RECO Off pk",null,{"$f":"'BGS Cost & Bid Factors'!D329","v":0.72099999999999997}]
[]
[]
[null,"Constant Blk 1",{"$f":"'BGS Cost & Bid Factors'!C332","v":-26.410592999999999}]
[null,"Constant Blk 2",{"$f":"'BGS Cost & Bid Factors'!C333","v":19.899406999999997}]
[]
[]
[null,"Winter - all hrs",{"$f":"'BGS Cost & Bid Factors'!C336","v":1.181},null,{"$f":"'BGS Cost & Bid Factors'!E336","v":0.98899999999999999},{"$f":"'BGS Cost & Bid Factors'!F336","v":0.92500000000000004},{"$f":"'BGS Cost & Bid Factors'!G336","v":0.92200000000000004}]
[null,"RECO On pk",null,{"$f":"'BGS Cost & Bid Factors'!D337","v":1.524}]
[null,"RECO Off pk",null,{"$f":"'BGS Cost & Bid Factors'!D338","v":0.88300000000000001}]
[]
[null,"Annual - all hrs",{"$f":"'BGS Cost & Bid Factors'!C340","v":1.1020000000000001},{"$f":"'BGS Cost & Bid Factors'!D340","v":1.069},{"$f":"'BGS Cost & Bid Factors'!E340","v":0.96395876870324915},{"$f":"'BGS Cost & Bid Factors'!F340","v":0.89400000000000002},{"$f":"'BGS Cost & Bid Factors'!G340","v":0.89300000000000002}]
[]
[]
[null,"DEMAND RATES"]
[null,"includes energy and Ancillary Services, G&T obligations charged separately - adjusted to billing time periods"]
[]
[null,null,{"$f":"'BGS Cost & Bid Factors'!H6","v":"SC2 Dem"},{"$f":"+C33","v":"SC2 Dem"},null,null,"PLUS:"]
[null,null,"Multiplier","Constant"]
[null,"Summer - all hrs",{"$f":"'BGS Cost & Bid Factors'!C348","v":0.97499999999999998},{"$f":"'BGS Cost & Bid Factors'!D348","v":-10.957785675590245},null,null,"Gen Cost (per kW of Billed Demand/Month)"]
[]
[null,null,null,null,null,null,null,{"$f":"'BGS Cost & Bid Factors'!G212","v":0},{"$f":"'BGS Cost & Bid Factors'!H212","v":"< 5 kW"},{"$f":"'BGS Cost & Bid Factors'!I212","v":"> 5 kW"}]
[]
[null,"Winter - all hrs",{"$f":"'BGS Cost & Bid Factors'!C352","v":1.07},{"$f":"'BGS Cost & Bid Factors'!D352","v":-10.625392199708756},null,null,"summer",{"$f":"'BGS Cost & Bid Factors'!H352","v":0},{"$f":"'BGS Cost & Bid Factors'!I352","v":0.80100000000000005},{"$f":"'BGS Cost & Bid Factors'!J352","v":2.952}]
[null,null,null,null,null,null,"winter",{"$f":"'BGS Cost & Bid Factors'!H353","v":0},{"$f":"'BGS Cost & Bid Factors'!I353","v":1.034},{"$f":"'BGS Cost & Bid Factors'!J353","v":2.6819999999999999}]
{"$rows_left_out":247}
{"sheet":"Backup Calcs","index":3,"n_rows":106,"n_cols":16,"rows_kept":106,"cut":false,"hidden":false,"merged":[]}
["SC2 Sales and Demands"]
[]
["Actual Data"]
[null,null,"Percent",null,null,null,null,null,null,null,null,null,null,null,"Number of","Average Use/"]
[null,"Total","Non-Demand","Non-Demand","Demand","Hours",null,"First","Over 5",null,null,null,null,"% of 5kW","Demand Billed","Demand Billed"]
[null,"MWh","Metered","Metered MWh","Metered MWh","Use","kW","5 kW","kW",null,null,null,null,"Per Cust","Customers","Customers"]
[]
["Jan",{"$f":"D8+E8","v":56590.874734426128},{"$f":"ROUND(D8/B8,4)","v":4.3299999999999998E-2},2452.7653675552524,54138.109366870878,{"$f":"E8*1000/G8","v":373.99509911748834},{"$f":"H8+I8","v":144756.19999999978},27387.100000000035,117369.09999999973,null,null,null,null,{"$f":"H8/(O8*5)","v":0.76697020756223},7141.6333333333332,{"$f":"E8/O8*1000","v":7580.6341266756272}]
["Feb",{"$f":"D9+E9","v":45048.834803055688},{"$f":"ROUND(D9/B9,4)","v":5.5500000000000001E-2},2501.7083155254859,42547.1264875302,{"$f":"E9*1000/G9","v":299.70236585409469},{"$f":"H9+I9","v":141964.59999999998},27425.900000000031,114538.69999999995,null,null,null,null,{"$f":"H9/(O9*5)","v":0.76560185357501875},7164.5333333333319,{"$f":"E9/O9*1000","v":5938.5761092879102}]
["Mar",32183.750871403281,6.4299999999999996E-2,2069.8293384760018,30113.921532927281,216.91658070556255,138827.20000000004,25852.700000000041,112974.5,null,null,null,null,0.76881161374101159,6725.3666666666677,4477.6624123979282]
["Apr",46104.576538556139,3.6799999999999999E-2,1698.9187954522224,44405.657743103919,285.94353040598747,155295.20000000004,28847.100000000053,126448.09999999998,null,null,null,null,0.75470857297339888,7644.5666666666639,5808.786773582623]
["May",42354.403045012412,3.2500000000000001E-2,1376.0365633313288,40978.366481681085,278.16718990847659,147315.59999999969,27293.399999999983,120022.19999999969,null,null,null,null,0.76064675253494007,7176.3666666666722,5710.1829358887808]
["Jun",46527.836232255017,2.92E-2,1358.1850642430834,45169.651168011937,281.81626066809116,160280.49999999983,26477.099999999973,133803.39999999985,null,null,null,null,0.74744097637172802,7084.7333333333336,6375.6318047273389]
["Jul",50876.054040435032,3.0300000000000001E-2,1541.0917336100015,49334.962306825029,289.6258977284005,170340.29999999987,26497.399999999991,143842.89999999988,null,null,null,null,0.7489548934165583,7075.8333333333348,6972.3183097621031]
["Aug",54049.896578316992,2.9000000000000001E-2,1566.1857426600004,52483.710835656988,315.12493229109816,166548.90000000034,26519.499999999967,140029.40000000037,null,null,null,null,0.73249856139946945,7240.8333333333358,7248.2970425582189]
["Sep",51025.783302213298,2.7900000000000001E-2,1423.1722717809687,49602.61103043233,296.31968241956349,167395.60000000015,26809.29999999997,140586.30000000019,null,null,null,null,0.74231773837761927,7223.1333333333323,6867.1875128659312]
["Oct",47378.75258003037,3.0200000000000001E-2,1431.4505888921556,45947.301991138214,299.78698535647504,153266.50000000009,26862.900000000074,126403.60000000002,null,null,null,null,0.74838832499094754,7178.8666666666686,6400.3559509585821]
["Nov",42414.99964904724,3.2099999999999997E-2,1362.5965261389645,41052.403122908276,289.04321469695782,142028.59999999977,27052.40000000002,114976.19999999976,null,null,null,null,0.7622255198452208,7098.2666666666692,5783.4405286137826]
["Dec",46830.993544255551,4.4600000000000001E-2,2090.9315077687361,44740.062036486815,306.15338740042262,146136.09999999971,27548.099999999977,118587.99999999974,null,null,null,null,0.76032512695959276,7246.4000000000033,6174.1088038870057]
[]
["Total",{"$f":"SUM(B8:B19)","v":561386.755919007},null,{"$f":"SUM(D8:D19)","v":20872.871815434199},{"$f":"SUM(E8:E19)","v":540513.88410357293},null,{"$f":"SUM(G8:G19)","v":1834155.2999999991},{"$f":"SUM(H8:H19)","v":324572.90000000008},{"$f":"SUM(I8:I19)","v":1509582.3999999994}]
[null,null,null,{"$f":"ROUND(D21/B21,3)","v":3.6999999999999998E-2},{"$f":"ROUND(E21/B21,3)","v":0.96299999999999997}]
[]
["Summer",{"$f":"SUM(B13:B16)","v":202479.57015322032},null,{"$f":"SUM(D13:D16)","v":5888.6348122940535},{"$f":"SUM(E13:E16)","v":196590.93534092628},null,{"$f":"SUM(G13:G16)","v":664565.30000000028},{"$f":"SUM(H13:H16)","v":106303.2999999999},{"$f":"SUM(I13:I16)","v":558262.00000000023}]
["Winter",{"$f":"SUM(B8:B12)+SUM(B17:B19)","v":358907.18576578679},null,{"$f":"SUM(D8:D12)+SUM(D17:D19)","v":14984.237003140146},{"$f":"SUM(E8:E12)+SUM(E17:E19)","v":343922.94876264664},null,{"$f":"SUM(G8:G12)+SUM(G17:G19)","v":1169589.9999999991},{"$f":"SUM(H8:H12)+SUM(H17:H19)","v":218269.60000000021},{"$f":"SUM(I8:I12)+SUM(I17:I19)","v":951320.39999999898}]
[]
[]
["Forecast Data - Without CIEP Expansion"]
[]
[null,null,"Percent",null,null,null,null,null,null,null,null,null,null,null,"Number of","Average Use/"]
[null,"Total","Non-Demand","Non-Demand","Demand","Hours",null,"First","Over 5",null,null,null,null,"% of 5kW","Demand Billed","Demand Billed"]
[null,"MWh","Metered","Metered MWh","Metered MWh","Use","kW","5 kW","kW",null,null,null,null,"Per Cust","Customers","Customers"]
[]
["Jan",37514.5,{"$f":"C8","v":4.3299999999999998E-2},{"$f":"ROUND(B34*C8,0)","v":1624},{"$f":"B34-D34","v":35890.5},{"$f":"F8","v":373.99509911748834},{"$f":"ROUND(E34*1000/F34,0)","v":95965},{"$f":"O34*5*N34","v":18156.096030045275},{"$f":"G34-H34","v":77808.903969954728},null,null,null,null,{"$f":"N8","v":0.76697020756223},{"$f":"E34/P34*1000","v":4734.4983810396925},{"$f":"P8","v":7580.6341266756272}]
["Feb",32174,{"$f":"C9","v":5.5500000000000001E-2},1786,{"$f":"B35-D35","v":30388},{"$f":"F9","v":299.70236585409469},{"$f":"ROUND(E35*1000/F35,0)","v":101394},{"$f":"O35*5*N35","v":19588.120702916585},{"$f":"G35-H35","v":81805.879297083418},null,null,null,null,{"$f":"N9","v":0.76560185357501875},{"$f":"E35/P35*1000","v":5117.0515357163285},{"$f":"P9","v":5938.5761092879102}]
["Mar",33355.5,6.4299999999999996E-2,2145,31210.5,216.91658070556255,143883,26794.108912973825,117088.89108702618,null,null,null,null,0.76881161374101159,6970.266430444407,4477.6624123979282]
["Apr",33731.5,3.6799999999999999E-2,1241,32490.5,285.94353040598747,113626,21106.695637124198,92519.304362875802,null,null,null,null,0.75470857297339888,5593.3366581402652,5808.786773582623]
["May",30094.5,3.2500000000000001E-2,978,29116.5,278.16718990847659,104673,19392.873589903982,85280.126410096011,null,null,null,null,0.76064675253494007,5099.048546588826,5710.1829358887808]
["Jun",32415.5,2.92E-2,947,31468.5,281.81626066809116,111663,18445.89452884789,93217.105471152114,null,null,null,null,0.74744097637172802,4935.7461289823941,6375.6318047273389]
["Jul",36516,3.0300000000000001E-2,1106,35410,289.6258977284005,122261,19018.417976376939,103242.58202362306,null,null,null,null,0.7489548934165583,5078.6551082186888,6972.3183097621031]
{"$rows_left_out":66}